{"text_format":"3","workbook":"xlsx","n_sheets":2,"sheets":["一干计趟邮路采购需求","一干计重邮路采购需求"],"not_rendered":{"external_links":1,"defined_names":1},"read":"whole","date_system":"1900"}

{"sheet":"一干计趟邮路采购需求","index":0,"n_rows":223,"n_cols":8,"rows_kept":223,"merged":[[0,0,0,7],[2,0,13,0],[14,0,28,0],[29,0,50,0],[51,0,79,0],[80,0,92,0],[93,0,102,0],[103,0,108,0],[109,0,112,0],[113,0,122,0],[123,0,129,0],[130,0,146,0],[147,0,149,0],[150,0,157,0],[158,0,164,0],[165,0,168,0],[169,0,172,0],[173,0,176,0],[177,0,180,0],[181,0,190,0],[191,0,193,0],[194,0,200,0],[201,0,203,0],[204,0,206,0],[207,0,212,0],[213,0,215,0],[216,0,220,0],[222,0,222,7]]}
["2022年浙江省一干汽车邮路运输外包服务采购项目线路明细"]
["分包","线路","单程里程","2022预计发车趟次","20吨车型车型最高限价（元）","标的（万元）","报价(元/趟)","备注"]
[1,"杭州-广州",1350,{"v":194.4,"d":"194"},8780,{"v":170.6832,"d":"170.68"}]
[null,"绍兴-广州",1330,{"v":9.6,"d":"10"},8715,{"v":8.3664,"d":"8.37"}]
[null,"湖州-广州",1328,204,{"v":9216.9,"d":"9217"},{"v":188.02476,"d":"188.02"}]
[null,"宁波-广州",1627,{"v":477.6,"d":"478"},9429,{"v":450.32904,"d":"450.33"}]
[null,"嘉兴-广州",1600,396,8820,{"v":349.272,"d":"349.27"}]
[null,"金华-广州",1200,{"v":997.2,"d":"997"},{"v":8431.5,"d":"8432"},{"v":840.78918,"d":"840.79"}]
[null,"温州-广州",1392,{"v":656.4,"d":"656"},{"v":8041.95,"d":"8042"},{"v":527.873598,"d":"527.87"},null,"往返"]
[null,"台州-广州",1396,{"v":1081.2,"d":"1081"},9030,{"v":976.3236,"d":"976.32"}]
[null,"慈溪-广州",1473,{"v":656.4,"d":"656"},9198,{"v":603.75672,"d":"603.76"}]
[null,"台州-东莞",1350,240,{"v":7946.4,"d":"7946"},{"v":190.7136,"d":"190.71"}]
[null,"金华-东莞",1150,330,{"v":8212.05,"d":"8212"},{"v":270.99765,"d":"271.00"}]
[null,"义乌-东莞",1210,{"v":10.8,"d":"11"},{"v":9251.55,"d":"9252"},{"v":9.991674,"d":"9.99"}]
[2,"杭州-中山",1480,{"v":28.8,"d":"29"},9000,25.92]
[null,"宁波-中山",1506,{"v":519.6,"d":"520"},9429,{"v":489.93084,"d":"489.93"}]
[null,"金华-中山",1280,618,{"v":9027.9,"d":"9028"},{"v":557.92422,"d":"557.92"}]
[null,"台州-中山",1370,{"v":514.8,"d":"515"},9030,{"v":464.8644,"d":"464.86"}]
[null,"温州-中山",1351,{"v":459.6,"d":"460"},{"v":8174.25,"d":"8174"},{"v":375.68853,"d":"375.69"}]
[null,"绍兴-中山",1450,414,9000,{"v":372.6,"d":"372.60"}]
[null,"金华-深圳",1188,{"v":471.6,"d":"472"},{"v":8222.55,"d":"8223"},{"v":387.775458,"d":"387.78"}]
[null,"宁波-深圳",1465,{"v":237.6,"d":"238"},8883,{"v":211.06008,"d":"211.06"},null,"串跑东莞"]
[null,"台州-深圳",1251,{"v":440.4,"d":"440"},8925,{"v":393.057,"d":"393.06"}]
[null,"温州-深圳",1221,{"v":231.6,"d":"232"},{"v":7606.2,"d":"7606"},{"v":176.159592,"d":"176.16"},null,"串跑东莞"]
[null,"杭州-深圳",1300,{"v":121.2,"d":"121"},{"v":8662.3,"d":"8662"},{"v":104.987076,"d":"104.99"}]
[null,"义乌-深圳",1280,{"v":69.6,"d":"70"},{"v":9038.4,"d":"9038"},{"v":62.907264,"d":"62.91"}]
[null,"义乌-揭阳",1060,{"v":7.2,"d":"7"},{"v":9081.45,"d":"9081"},{"v":6.538644,"d":"6.54"}]
[null,"杭州-揭阳",1250,732,{"v":8734.4,"d":"8734"},{"v":639.35808,"d":"639.36"},null,"串跑金华"]
[null,"金华-汕头",1000,{"v":568.8,"d":"569"},{"v":7692.3,"d":"7692"},{"v":437.538024,"d":"437.54"}]
[3,"杭州-南京",300,{"v":91.2,"d":"91"},{"v":2442.13,"d":"2442"},{"v":22.2722256,"d":"22.27"}]
[null,"湖州-南京",250,12,2415,{"v":2.898,"d":"2.90"}]
[null,"嘉兴-南京",310,{"v":109.2,"d":"109"},2300,{"v":25.116,"d":"25.12"}]
[null,"杭州-无锡",230,{"v":1909.2,"d":"1909"},{"v":1626.37,"d":"1626"},{"v":310.5065604,"d":"310.51"},null,"往返"]
[null,"湖州-无锡",135,{"v":1149.6,"d":"1150"},{"v":1348.2,"d":"1348"},{"v":154.989072,"d":"154.99"}]
[null,"嘉兴-无锡",180,{"v":650.4,"d":"650"},{"v":1980.3,"d":"1980"},{"v":128.798712,"d":"128.80"}]
[null,"绍兴-无锡",250,96,{"v":1886.85,"d":"1887"},{"v":18.11376,"d":"18.11"}]
[null,"杭州-南集",340,486,{"v":2087.81,"d":"2088"},{"v":101.467566,"d":"101.47"},null,"往返"]
[null,"宁波-南集",401,168,2940,{"v":49.392,"d":"49.39"}]
[null,"嘉兴-南集",280,{"v":393.6,"d":"394"},{"v":2242.8,"d":"2243"},{"v":88.276608,"d":"88.28"},null,"往返"]
[null,"杭州-苏州",180,{"v":874.8,"d":"875"},1975,{"v":172.773,"d":"172.77"},null,"往返"]
[null,"宁波-无锡",280,{"v":676.8,"d":"677"},{"v":1942.5,"d":"1943"},{"v":131.4684,"d":"131.47"}]
[null,"宁波-南京",500,{"v":51.6,"d":"52"},3045,{"v":15.7122,"d":"15.71"}]
[null,"宁波-南通",330,{"v":45.6,"d":"46"},2625,11.97]
[null,"宁波-常州",380,18,2835,{"v":5.103,"d":"5.10"}]
[null,"宁波-徐州",800,{"v":25.2,"d":"25"},7350,{"v":18.522,"d":"18.52"}]
[null,"宁波-苏州",400,{"v":464.4,"d":"464"},2730,{"v":126.7812,"d":"126.78"},null,"往返"]
[null,"慈溪-南京",450,{"v":16.8,"d":"17"},2310,{"v":3.8808,"d":"3.88"}]
[null,"慈溪-苏州",305,66,2000,{"v":13.2,"d":"13.20"}]
[null,"慈溪-无锡",230,600,1470,{"v":88.2,"d":"88.20"}]
[null,"杭州-徐州",620,{"v":98.4,"d":"98"},{"v":3995.37,"d":"3995"},{"v":39.3144408,"d":"39.31"}]
[null,"杭州-常州",265,450,{"v":2191.84,"d":"2192"},{"v":98.6328,"d":"98.63"},null,"往返"]
[4,"金华-南京",510,{"v":712.8,"d":"713"},{"v":3482.85,"d":"3483"},{"v":248.257548,"d":"248.26"}]
[null,"台州-南京",550,{"v":688.8,"d":"689"},{"v":3786.3,"d":"3786"},{"v":260.800344,"d":"260.80"}]
[null,"温州-南京",620,504,{"v":4111.8,"d":"4112"},{"v":207.23472,"d":"207.23"},null,"往返"]
[null,"义乌-南京",425,{"v":128.4,"d":"128"},{"v":3660.3,"d":"3660"},{"v":46.998252,"d":"47.00"}]
[null,"金华-南集",510,{"v":370.8,"d":"371"},{"v":3482.85,"d":"3483"},{"v":129.144078,"d":"129.14"}]
[null,"金华-无锡",370,1548,{"v":2360.4,"d":"2360"},{"v":365.38992,"d":"365.39"}]
[null,"台州-无锡",500,{"v":963.6,"d":"964"},{"v":2650.2,"d":"2650"},{"v":255.373272,"d":"255.37"}]
[null,"温州-无锡",520,{"v":440.4,"d":"440"},{"v":3268.65,"d":"3269"},{"v":143.951346,"d":"143.95"}]
[null,"义乌-无锡",330,{"v":44.4,"d":"44"},{"v":2668.05,"d":"2668"},{"v":11.846142,"d":"11.85"}]
[null,"金华-苏州",350,{"v":981.6,"d":"982"},{"v":2384.55,"d":"2385"},{"v":234.067428,"d":"234.07"},null,"往返"]
[null,"温州-苏州",460,{"v":63.6,"d":"64"},{"v":2849.7,"d":"2850"},{"v":18.124092,"d":"18.12"}]
[null,"台州-苏州",380,702,{"v":2335.2,"d":"2335"},{"v":163.93104,"d":"163.93"},null,"往返"]
[null,"义乌-苏州",295,18,{"v":2496.9,"d":"2497"},{"v":4.49442,"d":"4.49"}]
[null,"金华-常州",430,{"v":469.2,"d":"469"},{"v":2915.85,"d":"2916"},{"v":136.811682,"d":"136.81"}]
[null,"义乌-常州",360,{"v":13.2,"d":"13"},{"v":2915.85,"d":"2916"},{"v":3.848922,"d":"3.85"}]
[null,"金华-徐州",820,{"v":627.6,"d":"628"},{"v":4568.55,"d":"4569"},{"v":286.722198,"d":"286.72"}]
[null,"义乌-徐州",750,{"v":14.4,"d":"14"},{"v":4568.55,"d":"4569"},{"v":6.578712,"d":"6.58"}]
[null,"金华-南通",490,{"v":154.8,"d":"155"},{"v":3534.3,"d":"3534"},{"v":54.710964,"d":"54.71"}]
[null,"金华-盐城",600,432,{"v":4006.8,"d":"4007"},{"v":173.09376,"d":"173.09"}]
[null,"金华-淮安",650,{"v":175.2,"d":"175"},{"v":4985.4,"d":"4985"},{"v":87.344208,"d":"87.34"}]
[null,"金华-扬州",550,{"v":34.8,"d":"35"},{"v":4442.55,"d":"4443"},{"v":15.460074,"d":"15.46"},null,"串跑杭州"]
[null,"金华-镇江",530,{"v":398.4,"d":"398"},{"v":3029.25,"d":"3029"},{"v":120.68532,"d":"120.69"},null,"串跑杭州"]
[null,"金华-宿迁",800,{"v":70.8,"d":"71"},{"v":4859.4,"d":"4859"},{"v":34.404552,"d":"34.40"}]
[null,"金华-连云港",760,{"v":73.2,"d":"73"},{"v":4769.1,"d":"4769"},{"v":34.909812,"d":"34.91"}]
[null,"台州-南通",480,{"v":429.6,"d":"430"},{"v":3581.55,"d":"3582"},{"v":153.863388,"d":"153.86"},null,"往返"]
[null,"义乌-南通",380,6,{"v":3534.3,"d":"3534"},{"v":2.12058,"d":"2.12"}]
[null,"温州-南通",600,0,{"v":3710.7,"d":"3711"},{"v":0,"d":"0.00"}]
[null,"温州-徐州",950,{"v":46.8,"d":"47"},{"v":5545.05,"d":"5545"},{"v":25.950834,"d":"25.95"}]
[null,"台州-徐州",900,384,{"v":4953.9,"d":"4954"},{"v":190.22976,"d":"190.23"}]
[5,"杭州-济南",1080,420,5459,{"v":229.278,"d":"229.28"}]
[null,"绍兴-济南",1080,6,7140,{"v":4.284,"d":"4.28"}]
[null,"湖州-济南",850,{"v":424.8,"d":"425"},5565,{"v":236.4012,"d":"236.40"}]
[null,"嘉兴-济南",1000,{"v":439.2,"d":"439"},5250,230.58]
[null,"宁波-济南",1065,{"v":151.2,"d":"151"},5670,{"v":85.7304,"d":"85.73"}]
[null,"杭州-青岛",940,270,5253,{"v":141.831,"d":"141.83"}]
[null,"宁波-青岛",1110,{"v":417.6,"d":"418"},{"v":6352.5,"d":"6353"},{"v":265.2804,"d":"265.28"}]
[null,"金华-济南",1180,{"v":499.2,"d":"499"},6000,299.52]
[null,"台州-济南",1122,{"v":700.8,"d":"701"},6510,{"v":456.2208,"d":"456.22"}]
[null,"温州-济南",1203,{"v":495.6,"d":"496"},{"v":6562.5,"d":"6563"},{"v":325.2375,"d":"325.24"}]
[null,"金华-青岛",1050,684,6090,{"v":416.556,"d":"416.56"}]
[null,"台州-青岛",1100,522,6930,{"v":361.746,"d":"361.75"}]
[null,"温州-青岛",1201,432,6930,{"v":299.376,"d":"299.38"}]
[6,"杭州-郑州",1152,576,5665,{"v":326.304,"d":"326.30"}]
[null,"湖州-郑州",935,468,{"v":6226.5,"d":"6227"},{"v":291.4002,"d":"291.40"}]
[null,"嘉兴-郑州",1000,{"v":182.4,"d":"182"},{"v":6457.5,"d":"6458"},{"v":117.7848,"d":"117.78"}]
[null,"宁波-郑州",1165,{"v":460.8,"d":"461"},{"v":6457.5,"d":"6458"},{"v":297.5616,"d":"297.56"}]
[null,"金华-郑州",1170,720,{"v":6877.5,"d":"6878"},495.18]
[null,"温州-郑州",1291,{"v":691.2,"d":"691"},7245,{"v":500.7744,"d":"500.77"}]
[null,"金华-驻马店",1000,{"v":187.2,"d":"187"},{"v":5288.85,"d":"5289"},{"v":99.007272,"d":"99.01"}]
[null,"义乌-驻马店",960,72,{"v":7520.1,"d":"7520"},{"v":54.14472,"d":"54.14"}]
[null,"台州-驻马店",1100,{"v":199.2,"d":"199"},6405,{"v":127.5876,"d":"127.59"}]
[null,"温州-驻马店",1100,{"v":100.8,"d":"101"},5818,{"v":58.64544,"d":"58.65"}]
[7,"杭州-上海",310,{"v":1491.6,"d":"1492"},{"v":2310.29,"d":"2310"},{"v":344.6028564,"d":"344.60"}]
[null,"湖州-上海",170,{"v":532.8,"d":"533"},1900,{"v":101.232,"d":"101.23"},null,"往返"]
[null,"嘉兴-上海",170,{"v":304.8,"d":"305"},{"v":1564.5,"d":"1565"},{"v":47.68596,"d":"47.69"}]
[null,"绍兴-上海",200,138,2142,{"v":29.5596,"d":"29.56"}]
[null,"宁波-上海",315,{"v":1075.2,"d":"1075"},{"v":2693.25,"d":"2693"},{"v":289.57824,"d":"289.58"}]
[null,"慈溪-上海",270,{"v":1160.4,"d":"1160"},{"v":1585.5,"d":"1586"},{"v":183.98142,"d":"183.98"}]
[8,"金华-上海",380,{"v":2433.6,"d":"2434"},{"v":2181.9,"d":"2182"},{"v":530.987184,"d":"530.99"}]
[null,"义乌-上海",330,{"v":199.2,"d":"199"},{"v":2496.9,"d":"2497"},{"v":49.738248,"d":"49.74"}]
[null,"台州-上海",366,{"v":1543.2,"d":"1543"},{"v":2431.8,"d":"2432"},{"v":375.275376,"d":"375.28"},null,"往返"]
[null,"温州-上海",510,{"v":374.4,"d":"374"},{"v":3154.2,"d":"3154"},{"v":118.093248,"d":"118.09"}]
[9,"杭州-合肥",480,948,{"v":3409.3,"d":"3409"},{"v":323.20164,"d":"323.20"}]
[null,"湖州-合肥",400,216,2415,{"v":52.164,"d":"52.16"}]
[null,"嘉兴-合肥",450,204,2730,{"v":55.692,"d":"55.69"}]
[null,"杭州-芜湖",300,480,{"v":2587.36,"d":"2587"},{"v":124.19328,"d":"124.19"}]
[null,"杭州-阜阳",650,{"v":391.2,"d":"391"},{"v":5799.93,"d":"5800"},{"v":226.8932616,"d":"226.89"}]
[null,"杭州-马鞍",370,{"v":392.4,"d":"392"},3205,{"v":125.7642,"d":"125.76"},null,"串跑宣城"]
[null,"杭州-滁州",390,{"v":391.2,"d":"391"},{"v":3480.37,"d":"3480"},{"v":136.1520744,"d":"136.15"}]
[null,"杭州-六安",550,{"v":379.2,"d":"379"},{"v":3868.68,"d":"3869"},{"v":146.7003456,"d":"146.70"}]
[null,"宁波-合肥",665,{"v":226.8,"d":"227"},4000,90.72]
[null,"宁波-蚌埠",730,{"v":343.2,"d":"343"},4500,154.44]
[10,"金华-合肥",550,{"v":919.2,"d":"919"},{"v":4543.35,"d":"4543"},{"v":417.624732,"d":"417.62"}]
[null,"金华-芜湖",455,24,{"v":3828.3,"d":"3828"},{"v":9.18792,"d":"9.19"}]
[null,"金华-蚌埠",680,432,{"v":4061.4,"d":"4061"},{"v":175.45248,"d":"175.45"}]
[null,"台州-合肥",720,{"v":976.8,"d":"977"},3360,{"v":328.2048,"d":"328.20"}]
[null,"义乌-合肥",560,{"v":320.4,"d":"320"},{"v":4540.2,"d":"4540"},{"v":145.468008,"d":"145.47"}]
[null,"义乌-芜湖",400,6,{"v":3539.55,"d":"3540"},{"v":2.12373,"d":"2.12"}]
[null,"温州-合肥",750,{"v":511.2,"d":"511"},{"v":4991.7,"d":"4992"},{"v":255.175704,"d":"255.18"}]
[11,"杭州-福州",721,{"v":872.4,"d":"872"},{"v":5396.17,"d":"5396"},{"v":470.7618708,"d":"470.76"}]
[null,"嘉兴-福州",770,{"v":92.4,"d":"92"},{"v":6187.65,"d":"6188"},{"v":57.173886,"d":"57.17"}]
[null,"杭州-厦门",1035,300,{"v":6407.63,"d":"6408"},{"v":192.2289,"d":"192.23"}]
[null,"宁波-福州",585,{"v":148.8,"d":"149"},{"v":4823.7,"d":"4824"},{"v":71.776656,"d":"71.78"}]
[null,"湖州-福州",750,156,{"v":6130.95,"d":"6131"},{"v":95.64282,"d":"95.64"}]
[null,"金华-福州",610,{"v":976.8,"d":"977"},{"v":4882.5,"d":"4883"},{"v":476.9226,"d":"476.92"}]
[null,"金华-厦门",860,210,{"v":6058.5,"d":"6059"},{"v":127.2285,"d":"127.23"}]
[null,"金华-泉州",880,48,{"v":7043.4,"d":"7043"},{"v":33.80832,"d":"33.81"}]
[null,"台州-福州",695,{"v":890.4,"d":"890"},{"v":4352.25,"d":"4352"},{"v":387.52434,"d":"387.52"}]
[null,"台州-厦门",679,{"v":134.4,"d":"134"},{"v":6033.3,"d":"6033"},{"v":81.087552,"d":"81.09"}]
[null,"台州-泉州",610,378,5418,{"v":204.8004,"d":"204.80"}]
[null,"温州-福州",430,576,2990,{"v":172.224,"d":"172.22"},null,"往返"]
[null,"温州-泉州",495,66,3442,{"v":22.7172,"d":"22.72"}]
[null,"温州-厦门",615,{"v":1.2,"d":"1"},4276,{"v":0.51312,"d":"0.51"}]
[null,"义乌-福州",635,{"v":103.2,"d":"103"},{"v":4810.05,"d":"4810"},{"v":49.639716,"d":"49.64"}]
[null,"义乌-厦门",880,{"v":56.4,"d":"56"},{"v":6371.4,"d":"6371"},{"v":35.934696,"d":"35.93"}]
[null,"义乌-泉州",700,{"v":1.2,"d":"1"},{"v":5735.1,"d":"5735"},{"v":0.688212,"d":"0.69"}]
[12,"金华-长沙",875,{"v":919.2,"d":"919"},6741,{"v":619.63272,"d":"619.63"}]
[null,"湖州-长沙",1100,{"v":220.8,"d":"221"},8190,{"v":180.8352,"d":"180.84"}]
[null,"嘉兴-长沙",1300,108,{"v":8452.5,"d":"8453"},{"v":91.287,"d":"91.29"}]
[13,"杭州-石家庄",1300,492,{"v":7300.64,"d":"7301"},{"v":359.191488,"d":"359.19"}]
[null,"杭州-廊坊",1297,438,{"v":7153.35,"d":"7153"},{"v":313.31673,"d":"313.32"}]
[null,"宁波-石家庄",1505,{"v":170.4,"d":"170"},{"v":7694.4,"d":"7694"},{"v":131.112576,"d":"131.11"}]
[null,"杭州-保定",1250,{"v":82.8,"d":"83"},7622,{"v":63.11016,"d":"63.11"}]
[null,"金华-石家庄",1410,{"v":483.6,"d":"484"},{"v":8702.4,"d":"8702"},{"v":420.848064,"d":"420.85"}]
[null,"台州-石家庄",1500,{"v":235.2,"d":"235"},{"v":8032.5,"d":"8033"},{"v":188.9244,"d":"188.92"}]
[null,"金华-廊坊",1300,{"v":495.6,"d":"496"},{"v":8307.6,"d":"8308"},{"v":411.724656,"d":"411.72"}]
[null,"金华-保定",1400,{"v":51.6,"d":"52"},{"v":9090.9,"d":"9091"},{"v":46.909044,"d":"46.91"}]
[14,"杭州-武汉",1000,174,{"v":6056.4,"d":"6056"},{"v":105.38136,"d":"105.38"}]
[null,"湖州-武汉",820,{"v":194.4,"d":"194"},6279,{"v":122.06376,"d":"122.06"}]
[null,"嘉兴-武汉",1000,{"v":116.4,"d":"116"},{"v":6289.5,"d":"6290"},{"v":73.20978,"d":"73.21"}]
[null,"宁波-武汉",960,{"v":469.2,"d":"469"},{"v":6641.25,"d":"6641"},{"v":311.60745,"d":"311.61"}]
[null,"金华-武汉",760,912,{"v":6016.5,"d":"6017"},{"v":548.7048,"d":"548.70"},null,"往返"]
[null,"台州-武汉",950,{"v":632.4,"d":"632"},{"v":6714.75,"d":"6715"},{"v":424.64079,"d":"424.64"}]
[null,"温州-武汉",981,{"v":554.4,"d":"554"},6715,{"v":372.2796,"d":"372.28"}]
[15,"杭州-西安",1480,444,8549,{"v":379.5756,"d":"379.58"}]
[null,"宁波-西安",1620,318,9000,{"v":286.2,"d":"286.20"}]
[null,"杭州-银川",2000,{"v":127.2,"d":"127"},{"v":15627.16,"d":"15627"},{"v":198.7774752,"d":"198.78"}]
[null,"金华-银川",2170,{"v":39.6,"d":"40"},{"v":18780.3,"d":"18780"},{"v":74.369988,"d":"74.37"}]
[16,"杭州-贵阳",1800,624,{"v":14183.1,"d":"14183"},{"v":885.02544,"d":"885.03"}]
[null,"宁波-贵阳",2055,{"v":254.4,"d":"254"},15120,{"v":384.6528,"d":"384.65"}]
[null,"台州-贵阳",1750,{"v":201.6,"d":"202"},{"v":13891.5,"d":"13892"},{"v":280.05264,"d":"280.05"}]
[null,"温州-贵阳",1700,{"v":15.6,"d":"16"},{"v":13769.7,"d":"13770"},{"v":21.480732,"d":"21.48"}]
[17,"杭州-昆明",2400,774,{"v":15676.6,"d":"15677"},{"v":1213.36884,"d":"1213.37"},null,"往返"]
[null,"宁波-昆明",2505,{"v":271.2,"d":"271"},17094,{"v":463.58928,"d":"463.59"}]
[null,"台州-昆明",2401,{"v":160.8,"d":"161"},{"v":15823.5,"d":"15824"},{"v":254.44188,"d":"254.44"}]
[null,"温州-昆明",2300,{"v":14.4,"d":"14"},{"v":14808.15,"d":"14808"},{"v":21.323736,"d":"21.32"}]
[18,"杭州-南宁",1850,{"v":424.8,"d":"425"},13802,{"v":586.30896,"d":"586.31"}]
[null,"宁波-南宁",2060,{"v":295.2,"d":"295"},{"v":14899.5,"d":"14900"},{"v":439.83324,"d":"439.83"}]
[null,"台州-南宁",1600,216,{"v":14962.5,"d":"14963"},323.19]
[null,"温州-南宁",1780,{"v":14.4,"d":"14"},14511,{"v":20.89584,"d":"20.90"}]
[19,"杭州-南昌",650,{"v":487.2,"d":"487"},{"v":4377.5,"d":"4378"},{"v":213.2718,"d":"213.27"}]
[null,"杭州-鹰潭",500,{"v":37.2,"d":"37"},{"v":4443.42,"d":"4443"},{"v":16.5295224,"d":"16.53"}]
[null,"宁波-南昌",720,6,{"v":4853.1,"d":"4853"},{"v":2.91186,"d":"2.91"}]
[null,"义乌-南昌",495,24,{"v":3896.55,"d":"3897"},{"v":9.35172,"d":"9.35"}]
[null,"宁波-鹰潭",611,{"v":542.4,"d":"542"},{"v":4710.3,"d":"4710"},{"v":255.486672,"d":"255.49"}]
[null,"金华-南昌",510,{"v":1088.4,"d":"1088"},{"v":4071.9,"d":"4072"},{"v":443.185596,"d":"443.19"}]
[null,"金华-鹰潭",400,{"v":217.2,"d":"217"},{"v":3873.45,"d":"3873"},{"v":84.131334,"d":"84.13"}]
[null,"台州-南昌",600,{"v":152.4,"d":"152"},{"v":4853.1,"d":"4853"},{"v":73.961244,"d":"73.96"}]
[null,"温州-南昌",670,{"v":478.8,"d":"479"},{"v":4853.1,"d":"4853"},{"v":232.366428,"d":"232.37"}]
[null,"台州-鹰潭",700,{"v":790.8,"d":"791"},{"v":5297.25,"d":"5297"},{"v":418.90653,"d":"418.91"}]
[20,"宁波-沈阳",1975,{"v":512.4,"d":"512"},11180,{"v":572.8632,"d":"572.86"}]
[null,"台州-沈阳",2000,{"v":57.6,"d":"58"},13440,{"v":77.4144,"d":"77.41"}]
[null,"金华-锦州",1800,18,12600,22.68]
[21,"宁波-太原",1555,{"v":43.2,"d":"43"},10437,{"v":45.08784,"d":"45.09"}]
[null,"金华-太原",1560,{"v":547.2,"d":"547"},{"v":9628.5,"d":"9629"},{"v":526.87152,"d":"526.87"}]
[null,"金华-北京",1510,{"v":603.6,"d":"604"},{"v":8662.5,"d":"8663"},{"v":522.8685,"d":"522.87"}]
[null,"台州-太原",1650,{"v":19.2,"d":"19"},{"v":11371.5,"d":"11372"},{"v":21.83328,"d":"21.83"}]
[null,"杭州-侯马",1250,{"v":320.4,"d":"320"},{"v":6887.61,"d":"6888"},{"v":220.6790244,"d":"220.68"}]
[null,"金华-侯马",1450,{"v":262.8,"d":"263"},8523,{"v":223.98444,"d":"223.98"}]
[null,"温州-太原",1700,{"v":8.4,"d":"8"},{"v":11371.5,"d":"11372"},{"v":9.55206,"d":"9.55"}]
[22,"金华-呼市",1990,{"v":435.6,"d":"436"},{"v":13359.15,"d":"13359"},{"v":581.924574,"d":"581.92"}]
[null,"宁波-呼市",1905,{"v":25.2,"d":"25"},{"v":15474.9,"d":"15475"},{"v":38.996748,"d":"39.00"}]
[null,"台州-呼市",2050,{"v":14.4,"d":"14"},{"v":17847.9,"d":"17848"},{"v":25.700976,"d":"25.70"}]
[23,"杭州-重庆",1689,708,13905,{"v":984.474,"d":"984.47"}]
[null,"宁波-重庆",1900,{"v":148.8,"d":"149"},{"v":14857.5,"d":"14858"},{"v":221.0796,"d":"221.08"}]
[null,"台州-重庆",1799,{"v":46.8,"d":"47"},{"v":15928.5,"d":"15929"},{"v":74.54538,"d":"74.55"}]
[24,"杭州-兰州",2070,{"v":374.4,"d":"374"},{"v":12648.4,"d":"12648"},{"v":473.556096,"d":"473.56"}]
[null,"金华-西安",1520,846,{"v":10745.7,"d":"10746"},{"v":909.08622,"d":"909.09"},null,"往返"]
[null,"台州-兰州",2300,{"v":10.8,"d":"11"},{"v":16474.5,"d":"16475"},{"v":17.79246,"d":"17.79"}]
[null,"温州-兰州",2300,{"v":62.4,"d":"62"},{"v":16034.55,"d":"16035"},{"v":100.055592,"d":"100.06"}]
[null,"义乌-兰州",2100,{"v":1.2,"d":"1"},{"v":14689.5,"d":"14690"},{"v":1.76274,"d":"1.76"}]
[null,"杭州-西宁",2200,{"v":38.4,"d":"38"},15347,{"v":58.93248,"d":"58.93"}]
[25,"金华-长春",2239,{"v":388.8,"d":"389"},11865,{"v":461.3112,"d":"461.31"}]
[null,"宁波-长春",2150,{"v":22.8,"d":"23"},{"v":11392.5,"d":"11393"},{"v":25.9749,"d":"25.97"}]
[null,"台州-长春",2200,{"v":15.6,"d":"16"},18858,{"v":29.41848,"d":"29.42"}]
[26,"杭州-北京",1575,744,7500,{"v":558,"d":"558.00"},null,"往返"]
[null,"宁波-北京",1606,{"v":38.4,"d":"38"},10920,{"v":41.9328,"d":"41.93"}]
[null,"台州-北京",1499,{"v":33.6,"d":"34"},11000,36.96]
[null,"杭州-天津",1250,{"v":615.6,"d":"616"},{"v":7148.2,"d":"7148"},{"v":440.043192,"d":"440.04"}]
[null,"金华-天津",1500,{"v":466.8,"d":"467"},8568,{"v":399.95424,"d":"399.95"}]
[27,"杭州-海口",2150,300,{"v":16675.7,"d":"16676"},{"v":500.271,"d":"500.27"}]
["报价要求：1、不得高于限价；2、所有线路都必须报价；3、标准车型为20吨厢式车型。不符合报价要求者，视为报价无效。"]

{"sheet":"一干计重邮路采购需求","index":1,"n_rows":40,"n_cols":14,"rows_kept":40,"merged":[[0,0,0,13],[2,8,38,8],[2,11,38,11],[39,0,39,13]]}
["2022年浙江省一干汽车邮路运输外包服务采购项目线路明细"]
["编号（分包）","线路","里程","日常发运容积","2022预估量（吨/日）","计重报价限价（元/公斤）","标的（万元）","报价（计重）","价格分权重","报价计趟限价价（20吨）","报价（计趟）","价格分权重","标的（万元）","备注"]
[1,"杭州-成都",2000,216,19.2,{"v":1.14555,"d":"1.146"},{"v":802.80144,"d":"802.80"},null,{"v":0.9,"d":"90%"},13327,null,{"v":0.1,"d":"10%"},{"v":802.80144,"d":"802.80"}]
[2,"杭州-长沙",1050,228,22.08,{"v":0.5943,"d":"0.594"},{"v":478.958256,"d":"478.96"},null,null,7524,null,null,{"v":478.958256,"d":"478.96"}]
[3,"杭州-沈阳",2000,276,23.4,0.956,{"v":816.5196,"d":"816.52"},null,null,11180,null,null,{"v":816.5196,"d":"816.52"}]
[4,"杭州-锦州",1700,222,19.32,{"v":0.93975,"d":"0.940"},{"v":662.692905,"d":"662.69"},null,null,10200,null,null,{"v":662.692905,"d":"662.69"}]
[5,"杭州-呼市",1900,228,20.28,{"v":1.1655,"d":"1.166"},{"v":862.72641,"d":"862.73"},null,null,9600,null,null,{"v":862.72641,"d":"862.73"}]
[6,"杭州-长春",2100,216,18.84,{"v":1.2285,"d":"1.229"},{"v":844.79031,"d":"844.79"},null,null,11330,null,null,{"v":844.79031,"d":"844.79"}]
[7,"杭州-太原",1650,228,20.16,{"v":0.87675,"d":"0.877"},{"v":645.14772,"d":"645.15"},null,null,8827,null,null,{"v":645.14772,"d":"645.15"}]
[8,"金华-昆明",2100,{"v":259.2,"d":"259"},23.112,{"v":1.34505,"d":"1.345"},{"v":1134.6680394,"d":"1134.67"},null,null,14410,null,null,{"v":1134.6680394,"d":"1134.67"}]
[9,"金华-贵阳",1750,{"v":454.8,"d":"455"},32.844,{"v":1.04895,"d":"1.049"},{"v":1257.4875537,"d":"1257.49"},null,null,12750,null,null,{"v":1257.4875537,"d":"1257.49"}]
[10,"金华-南宁",1760,{"v":488.4,"d":"488"},34.44,{"v":0.96075,"d":"0.961"},{"v":1207.720395,"d":"1207.72"},null,null,11820,null,null,{"v":1207.720395,"d":"1207.72"}]
[11,"金华-成都",1900,{"v":405.6,"d":"406"},25.812,{"v":1.16445,"d":"1.164"},{"v":1097.0725941,"d":"1097.07"},null,null,12525,null,null,{"v":1097.0725941,"d":"1097.07"}]
[12,"金华-沈阳",2050,{"v":272.4,"d":"272"},19.284,{"v":1.0038,"d":"1.004"},{"v":706.5406908,"d":"706.54"},null,null,11120,null,null,{"v":706.5406908,"d":"706.54"}]
[13,"金华-兰州",2107,{"v":250.8,"d":"251"},18.816,1.407,{"v":966.305088,"d":"966.31"},null,null,13990,null,null,{"v":966.305088,"d":"966.31"}]
[14,"金华-重庆",1680,{"v":229.2,"d":"229"},14.496,1.281,{"v":677.782224,"d":"677.78"},null,null,13250,null,null,{"v":677.782224,"d":"677.78"}]
[15,"金华-海口",1800,204,17.016,{"v":1.3776,"d":"1.378"},{"v":855.6053184,"d":"855.61"},null,null,14800,null,null,{"v":855.6053184,"d":"855.61"}]
[16,"宁波-成都",2010,216,13.92,{"v":1.81,"d":"1.810"},{"v":919.6248,"d":"919.62"},null,null,11817,null,null,{"v":919.6248,"d":"919.62"}]
[17,"宁波-郑州",1165,192,12.48,{"v":1,"d":"1.000"},455.52,null,null,6150,null,null,455.52]
[18,"宁波-长沙",1050,216,14.832,1.012,{"v":547.864416,"d":"547.86"},null,null,6089,null,null,{"v":547.864416,"d":"547.86"}]
[19,"台州-西安",1800,288,14.4,{"v":1.2705,"d":"1.271"},{"v":667.7748,"d":"667.77"},null,null,10275,null,null,{"v":667.7748,"d":"667.77"}]
[20,"台州-成都",2100,240,12,{"v":2.1,"d":"2.100"},{"v":919.8,"d":"919.80"},null,null,12378,null,null,{"v":919.8,"d":"919.80"}]
[21,"台州-郑州",1206,216,11.16,{"v":1.2,"d":"1.200"},{"v":488.808,"d":"488.81"},null,null,6660,null,null,{"v":488.808,"d":"488.81"}]
[22,"台州-长沙",1151,216,11.4,1.155,{"v":480.5955,"d":"480.60"},null,null,7397,null,null,{"v":480.5955,"d":"480.60"}]
[23,"温州-石家庄",1600,162,12,1.221,{"v":534.798,"d":"534.80"},null,null,8350,null,null,{"v":534.798,"d":"534.80"}]
[24,"温州-成都",2200,216,15.6,1.507,{"v":858.0858,"d":"858.09"},null,null,12025,null,null,{"v":858.0858,"d":"858.09"}]
[25,"温州-中山",1300,162,14.4,0.935,{"v":491.436,"d":"491.44"},null,null,7785,null,null,{"v":491.436,"d":"491.44"}]
[26,"温州-长沙",1200,162,14.4,0.803,{"v":422.0568,"d":"422.06"},null,null,6849,null,null,{"v":422.0568,"d":"422.06"}]
[27,"温州-西安",1600,216,18,1.243,{"v":816.651,"d":"816.65"},null,null,11599,null,null,{"v":816.651,"d":"816.65"}]
[28,"义乌-武汉",{"$f":"VLOOKUP(B30,[1]Sheet1!B$1:E$65536,4,0)","v":830},{"v":181.2,"d":"181"},19.02,0.651,{"v":451.94373,"d":"451.94"},null,null,6378,null,null,{"v":451.94373,"d":"451.94"}]
[29,"义乌-长沙",{"$f":"VLOOKUP(B31,[1]Sheet1!B$1:E$65536,4,0)","v":960},{"v":187.2,"d":"187"},21.42,{"v":0.7035,"d":"0.704"},{"v":550.017405,"d":"550.02"},null,null,7175,null,null,{"v":550.017405,"d":"550.02"}]
[30,"义乌-成都",{"$f":"VLOOKUP(B32,[1]Sheet1!B$1:E$65536,4,0)","v":1950},{"v":182.4,"d":"182"},19.128,{"v":1.2915,"d":"1.292"},{"v":901.689138,"d":"901.69"},null,null,12525,null,null,{"v":901.689138,"d":"901.69"}]
[31,"义乌-广州",{"$f":"VLOOKUP(B33,[1]Sheet1!B$1:E$65536,4,0)","v":1210},180,19.968,0.756,{"v":550.996992,"d":"551.00"},null,null,7743,null,null,{"v":550.996992,"d":"551.00"}]
[32,"义乌-青岛",{"$f":"VLOOKUP(B34,[1]Sheet1!B$1:E$65536,4,0)","v":980},{"v":177.6,"d":"178"},13.32,{"v":0.6825,"d":"0.683"},{"v":331.81785,"d":"331.82"},null,null,7027,null,null,{"v":331.81785,"d":"331.82"}]
[33,"义乌-济南",{"$f":"VLOOKUP(B35,[1]Sheet1!B$1:E$65536,4,0)","v":1080},{"v":177.6,"d":"178"},19.272,0.672,{"v":472.703616,"d":"472.70"},null,null,6013,null,null,{"v":472.703616,"d":"472.70"}]
[34,"义乌-郑州",{"$f":"VLOOKUP(B36,[1]Sheet1!B$1:E$65536,4,0)","v":1125},180,21.36,{"v":0.7455,"d":"0.746"},{"v":581.22162,"d":"581.22"},null,null,7162,null,null,{"v":581.22162,"d":"581.22"}]
[35,"义乌-石家庄",{"$f":"VLOOKUP(B37,[1]Sheet1!B$1:E$65536,4,0)","v":1350},{"v":176.4,"d":"176"},12.84,0.987,{"v":462.56742,"d":"462.57"},null,null,7837,null,null,{"v":462.56742,"d":"462.57"}]
[36,"义乌-西安",{"$f":"VLOOKUP(B38,[1]Sheet1!B$1:E$65536,4,0)","v":1500},{"v":182.4,"d":"182"},19.92,0.924,{"v":671.82192,"d":"671.82"},null,null,9689,null,null,{"v":671.82192,"d":"671.82"}]
[37,"义乌-中山",1300,222,21.24,{"v":0.7875,"d":"0.788"},{"v":610.51725,"d":"610.52"},null,null,8319,null,null,{"v":610.51725,"d":"610.52"}]
["报价要求：1、不得高于限价；2、所有线路都必须报价。不符合报价要求者，视为报价无效。当计重模式标准不符合时，按计趟价格执行"]